{"text_format":"1","workbook":"xlsx","n_sheets":11,"sheets":["QA Checklist","Tool Navigation","Tool","Tool Guidance","Building Zone Breakdown","Building Zone Guidance","Detailed Input Spreadsheet ","Detailed Input Guidance","Energy Results","Water Results","DataExtract"],"not_rendered":{"charts":0,"images":308,"macros":1,"external_links":0,"defined_names":8,"comments":0,"pivot_tables":0},"unopened":[],"bounds":{"document_bytes":16777216,"sheet_cells":100000,"rows_first":2000,"rows_last":500,"rows_between":2000,"halvings":0,"cell_chars":16384,"cell_head_chars":4096},"cells_cut":0,"cells_raw":0,"read":"whole","date_system":"1900"}

{"sheet":"QA Checklist","index":0,"n_rows":17,"n_cols":3,"rows_kept":17,"cut":false,"hidden":true,"merged":[]}
[]
[null,"INTERNAL QA CHECKLIST"]
[]
[null,"Last Updated by:","Francois Retief"]
[]
[null,null,"Completed?"]
[null,"Make necessary changes. Be careful of existing links and formulas!","Y"]
[null,"Update 'Last Update' date on first sheet","Y"]
[null,"Update Changelog with description of change","Y"]
[null,"Ensure all sheets are locked (except hidden sheets)","N"]
{"$rows_left_out":8}
{"sheet":"Tool Navigation","index":1,"n_rows":41,"n_cols":3,"rows_kept":41,"cut":false,"hidden":false,"merged":[[6,0,6,5],[4,0,4,5],[0,0,0,5],[1,0,1,5],[2,0,2,5],[3,0,3,5],[5,0,5,5],[40,1,40,5],[7,0,7,5],[8,0,8,5],[9,0,9,5],[11,0,11,5],[10,0,10,5],[39,1,39,5]]}
["GBCSA's Energy Water Performance v1 Tool\n\nLast Issued - Nov 2014"]
["The pilot benchmarking tool is an operational performance measurement tool which rates the performance of a whole building, by comparing the energy and water usage figures against a national “average” benchmark."]
["Step 1: For a preliminary score only, input basic data in the 'Tool' sheet."]
["Step 2: For a formal final result, input detailed zone data in the 'Building Zone Breakdown' sheet, and the detailed consumption data in the 'Detailed Input"]
["Spreadsheet' sheet."]
["This is done as follows:    "]
["- In the 'Building Zone Breakdown' sheet the building is broken down into zones based on operating functionalities, once this data is captured it is"]
["transfered to the 'Detailed Input Spreadsheet' sheet using the 'Transfer Results' button. "]
["- In the 'Detailed Input Spreadsheet'' sheet the annual energy and water usages are entered according to billing periods, once this data is captured "]
["it is transfered to the 'Tool' sheet using the 'Transfer Results' button.   "]
{"$rows_left_out":32}
{"sheet":"Tool","index":2,"n_rows":32,"n_cols":21,"rows_kept":32,"cut":false,"hidden":false,"merged":[[0,0,0,11],[15,1,15,4],[4,7,4,11],[6,10,6,11],[8,10,8,11],[5,1,5,4],[22,0,22,11],[28,0,31,4],[23,1,23,4],[16,1,16,4],[8,1,8,4],[9,1,9,4],[15,7,15,11],[9,10,9,11],[10,1,10,4],[5,6,9,6],[21,1,21,4],[16,7,16,11],[4,1,4,4],[7,1,7,4],[6,1,6,4],[7,10,7,11],[17,1,17,4]]}
["GBCSA's Energy Water Performance v1 Tool"]
[]
["Building Details",null,null,null,null,null,"Energy Usage Inputs",null,null,null,null,null,null,null,null,null,null,null,null,null,"- Enter a value or select from the drop down list -"]
[]
["Building Name",null,null,null,null,null,"*Number of Computers",null,null,null,null,null,null,null,null,null,null,"-"]
["Street Address",null,null,null,null,null,"*Energy Usage for Previous 12 Months","Type","Unit","Fuel Factor (kgCO₂/kWh)","Quantity",null,null,null,null,null,null,"Mains Electricity",null,null,"- Enter a value or select from the drop down list -"]
[null,null,null,null,null,null,null,null,{"$f":"IF(S7 = \"Mains Electricity\", \"kWh\", IF(S7  = \"Town Gas (From Coal)\", \"GJ\",  IF(S7  = \"LPG\", \"GJ\",  IF(S7  = \"Natural Gas\", \"GJ\",  IF(S7  = \"Biogas\", \"GJ\",   IF(S7  = \"Diesel\", \"L\",  IF(S7  = \"Oil\", \"L\",   IF(S7  = \"Coal\", \"Tonnes\", \"\" )) )) ) ) ) )","v":"kWh"},{"$f":"IF(S7 = \"Mains Electricity\", \"1.2\", IF(S7 = \"Town Gas (From Coal)\", \"0.16\",  IF(S7 = \"LPG\", \"0.23\",  IF(S7 = \"Natural Gas\", \"0.2\",  IF(S7 = \"Biogas\", \"0.03\",   IF(S7 = \"Diesel\", \"0.27\",  IF(S7 = \"Oil\", \"0.26\",   IF(S7 = \"Coal\", \"0.35\", \"\" )) )) ) ) ) )","v":"1.2"},null,null,null,null,null,null,null,"Town Gas (From Coal)","Mains Electricity",null,"Typical office: approximately 45 hours per week"]
["Suburb",null,null,null,null,null,null,null,{"$f":"IF(S8 = \"Mains Electricity\", \"kWh\", IF(S8  = \"Town Gas (From Coal)\", \"GJ\",  IF(S8  = \"LPG\", \"GJ\",  IF(S8  = \"Natural Gas\", \"GJ\",  IF(S8  = \"Biogas\", \"GJ\",   IF(S8  = \"Diesel\", \"L\",  IF(S8  = \"Oil\", \"L\",   IF(S8  = \"Coal\", \"Tonnes\", \"\" )) )) ) ) ) )","v":""},{"$f":"IF(S8 = \"Mains Electricity\", \"1.2\", IF(S8 = \"Town Gas (From Coal)\", \"0.16\",  IF(S8 = \"LPG\", \"0.23\",  IF(S8 = \"Natural Gas\", \"0.2\",  IF(S8 = \"Biogas\", \"0.03\",   IF(S8 = \"Diesel\", \"0.27\",  IF(S8 = \"Oil\", \"0.26\",   IF(S8 = \"Coal\", \"0.35\", \"\" )) )) ) ) ) )","v":""},null,null,null,null,null,null,null,"LPG","-",null,"Call centre or similar: approximately 80 hours per week"]
["City",null,null,null,null,null,null,null,{"$f":"IF(S9 = \"Mains Electricity\", \"kWh\", IF(S9  = \"Town Gas (From Coal)\", \"GJ\",  IF(S9  = \"LPG\", \"GJ\",  IF(S9  = \"Natural Gas\", \"GJ\",  IF(S9  = \"Biogas\", \"GJ\",   IF(S9  = \"Diesel\", \"L\",  IF(S9  = \"Oil\", \"L\",   IF(S9  = \"Coal\", \"Tonnes\", \"\" )) )) ) ) ) )","v":""},{"$f":"IF(S9 = \"Mains Electricity\", \"1.2\", IF(S9 = \"Town Gas (From Coal)\", \"0.16\",  IF(S9 = \"LPG\", \"0.23\",  IF(S9 = \"Natural Gas\", \"0.2\",  IF(S9 = \"Biogas\", \"0.03\",   IF(S9 = \"Diesel\", \"0.27\",  IF(S9 = \"Oil\", \"0.26\",   IF(S9 = \"Coal\", \"0.35\", \"\" )) )) ) ) ) )","v":""},null,null,null,null,null,null,null,"Natural Gas","-",null,"24 hour operation: 120 hours per week"]
["Province",null,null,null,null,null,null,null,{"$f":"IF(S10 = \"Mains Electricity\", \"kWh\", IF(S10  = \"Town Gas (From Coal)\", \"GJ\",  IF(S10  = \"LPG\", \"GJ\",  IF(S10  = \"Natural Gas\", \"GJ\",  IF(S10  = \"Biogas\", \"GJ\",   IF(S10  = \"Diesel\", \"L\",  IF(S10  = \"Oil\", \"L\",   IF(S10  = \"Coal\", \"Tonnes\", \"\" )) )) ) ) ) )","v":""},{"$f":"IF(S10 = \"Mains Electricity\", \"1.2\", IF(S10 = \"Town Gas (From Coal)\", \"0.16\",  IF(S10 = \"LPG\", \"0.23\",  IF(S10 = \"Natural Gas\", \"0.2\",  IF(S10 = \"Biogas\", \"0.03\",   IF(S10 = \"Diesel\", \"0.27\",  IF(S10 = \"Oil\", \"0.26\",   IF(S10 = \"Coal\", \"0.35\", \"\" )) )) ) ) ) )","v":""},null,null,null,null,null,null,null,"Biogas","-"]
{"$rows_left_out":23}
{"sheet":"Tool Guidance","index":3,"n_rows":70,"n_cols":1,"rows_kept":70,"cut":false,"hidden":false,"merged":[[69,0,73,4],[3,0,5,4],[0,0,0,5],[49,1,49,4],[50,0,52,4],[60,0,61,4],[63,0,67,4]]}
["Energy Water Performance Tool                                                                                                                                                              Tool Input Guidance File"]
["Building Details"]
["Postal Code"]
["The South African postal code system consists of four digit codes ranging from 0001-9999 (please note that the number range 9000-9299 is excluded as this belongs to regions in Namibia). The following intervals may be used as a rough guide only:"]
[]
[]
["Limpopo"]
["- Northern and eastern regions 0699-0999"]
["- Southern and western regions 0500-0698"]
["North West"]
{"$rows_left_out":61}
{"sheet":"Building Zone Breakdown","index":4,"n_rows":121,"n_cols":41,"rows_kept":121,"cut":false,"hidden":false,"merged":[[1,37,7,37],[1,28,7,28],[1,29,7,29],[1,30,7,30],[1,31,7,31],[1,34,7,34],[1,35,7,35],[1,36,7,36],[1,19,7,19],[1,20,7,20],[1,32,7,32],[1,33,7,33],[1,22,7,22],[1,23,7,23],[1,26,7,26],[1,27,7,27],[1,24,7,24],[1,25,7,25],[0,0,0,16],[4,8,5,8],[4,0,5,0],[4,11,5,11],[4,15,5,15],[4,9,5,9],[4,2,5,2],[4,1,5,1],[1,21,7,21],[4,14,5,14],[4,12,5,12],[4,13,5,13],[110,0,114,16],[4,16,5,16],[4,3,5,3],[4,4,5,4],[4,5,5,5],[4,7,5,7],[4,6,5,6],[4,10,5,10]]}
["Energy Water Performance Tool                                                                                                                                                                                                                          Building Zone Breakdown",null,null,null,null,null,null,null,null,null,null,null,null,null,null,null,null,null,"-"]
[null,"Transfer to Detailed Input Spreadsheet",null,null,null,null,null,null,null,null,null,null,null,null,null,null,null,null,"Mains Electricity","Included","Office","Total Area Adjusted with Vacancy Rate","Included Office Area Adjusted with Vacancy Rate","Included Non Office Area","Energy 1 Conversion","Energy 2 Conversion","Equivalent Energy 1 for Excluded Zones","Equivalent Energy 2 for Excluded Zones","Included Office Area *OccHours Adjusted with Vacancy Rate","Included Non-office Area *(Default - OccHours)","Total","Included Office Area *NumComp Adjusted with Vacancy Rate","Included Non-office Area *(Default - NumComp )","Total","Included Office Area *NumOcc Adjusted with Vacancy Rate","Included Non-office Area *(Default - NumOcc)","Total","Water"]
[null,"Resets all inputs",null,null,null,null,null,null,null,null,null,null,null,null,null,null,null,null,"Town Gas (From Coal)"]
[null,"Is February 29 included in the rating period? ",null,null,null,null,null,null,null,null,null,null,null,null,null,null,null,null,"LPG"]
["Zone","Included in Rating?                          Y/N","Office Area? Y     /N","Floor Area (m²)","Annual Vacancy (days)","Weekly Operating Hours","Number of Computers","Number of Occupants","Excludable Energy Source ","Unit","Fuel Factor (kgCO₂/kWh)","Excludable Energy Usage","Excludable Energy Source ","Unit","Fuel Factor (kgCO2/kWh)","Excludable Energy Usage","Excludable Water Usage (kl) ",null,"Natural Gas"]
[null,null,null,null,null,null,null,null,null,null,null,null,null,null,null,null,null,null,"Biogas"]
["Totals","-","-",{"$f":"V113","v":0},"-",{"$f":"V118","v":0},{"$f":"V119","v":0},{"$f":"V120","v":0},"Mains Electricity (Equiv.)","kWh",1.2,{"$f":"V116*365/S13","v":0},"Mains Electricity (Equiv.)","kWh",1.2,{"$f":"V117*365/S13","v":0},{"$f":"V121*365/S13","v":0},null,"Diesel"]
[null,null,null,null,null,null,null,null,null,null,null,null,null,null,null,null,null,null,"Oil"]
[null,null,null,null,null,null,null,null,"-",{"$f":"IF(AN9 = \"Mains Electricity\", \"kWh\", IF(AN9 = \"Town Gas (From Coal)\", \"GJ\",  IF(AN9 = \"LPG\", \"GJ\",  IF(AN9 = \"Natural Gas\", \"GJ\",  IF(AN9 = \"Biogas\", \"GJ\",   IF(AN9 = \"Diesel\", \"L\",  IF(AN9 = \"Oil\", \"L\",   IF(AN9 = \"Coal\", \"Tonnes\", \"\" )) )) ) ) ) )","v":""},{"$f":"IF(AN9 = \"Mains Electricity\", \"1.2\", IF(AN9 = \"Town Gas (From Coal)\", \"0.16\",  IF(AN9 = \"LPG\", \"0.23\",  IF(AN9 = \"Natural Gas\", \"0.2\",  IF(AN9 = \"Biogas\", \"0.03\",   IF(AN9 = \"Diesel\", \"0.27\",  IF(AN9 = \"Oil\", \"0.26\",   IF(AN9 = \"Coal\", \"0.35\", \"\" )) )) ) ) ) )","v":""},null,"-",{"$f":"IF(AO9 = \"Mains Electricity\", \"kWh\", IF(AO9 = \"Town Gas (From Coal)\", \"GJ\",  IF(AO9 = \"LPG\", \"GJ\",  IF(AO9 = \"Natural Gas\", \"GJ\",  IF(AO9 = \"Biogas\", \"GJ\",   IF(AO9 = \"Diesel\", \"L\",  IF(AO9 = \"Oil\", \"L\",   IF(AO9 = \"Coal\", \"Tonnes\", \"\" )) )) ) ) ) )","v":""},{"$f":"IF(AO9 = \"Mains Electricity\", \"1.2\", IF(AO9 = \"Town Gas (From Coal)\", \"0.16\",  IF(AO9 = \"LPG\", \"0.23\",  IF(AO9 = \"Natural Gas\", \"0.2\",  IF(AO9 = \"Biogas\", \"0.03\",   IF(AO9 = \"Diesel\", \"0.27\",  IF(AO9 = \"Oil\", \"0.26\",   IF(AO9 = \"Coal\", \"0.35\", \"\" )) )) ) ) ) )","v":""},null,null,null,null,true,true,{"$f":"IF(AND(T9,U9),D9*(1-(E9/$S$13)),D9)","v":0},{"$f":"IF(AND(T9,U9),D9*(1-(E9/$S$13)),0)","v":0},{"$f":"IF(AND(T9,NOT(U9)),D9,0)","v":0},{"$f":" IF(AN9 = \"Town Gas (From Coal)\", 37.07,  IF(AN9 = \"LPG\", 53.28,  IF(AN9 = \"Natural Gas\", 46.33,  IF(AN9 = \"Biogas\", 6.95,   IF(AN9 = \"Diesel\", 2.67,  IF(AN9 = \"Oil\", 2.53,   IF(AN9 = \"Coal\", 1945.42, 1 )) )) ) ) )","v":1},{"$f":" IF(AO9 = \"Town Gas (From Coal)\", 37.07,  IF(AO9 = \"LPG\", 53.28,  IF(AO9 = \"Natural Gas\", 46.33,  IF(AO9 = \"Biogas\", 6.95,   IF(AO9 = \"Diesel\", 2.67,  IF(AO9 = \"Oil\", 2.53,   IF(AO9 = \"Coal\", 1945.42, 1 )) )) ) ) )","v":1},{"$f":"IF(NOT(T9),Y9*L9,0)","v":0},{"$f":"IF(NOT(T9),Z9*P9,0)","v":0},{"$f":"W9*F9","v":0},{"$f":"X9*45","v":0},{"$f":"AC9+AD9","v":0},{"$f":"IF(AND(T9,U9),G9*(1-(E9/$S$13)),0)","v":0},{"$f":"IF(AND(T9,NOT(U9)),(D9/19),0)","v":0},{"$f":"AF9+AG9","v":0},{"$f":"IF(AND(T9,U9),H9*(1-(E9/$S$13)),0)","v":0},{"$f":"AG9","v":0},{"$f":"AI9+AJ9","v":0},{"$f":"IF(NOT(T9),Q9,0)","v":0},null,"-","-"]
[null,null,null,null,null,null,null,null,"-",{"$f":"IF(AN10 = \"Mains Electricity\", \"kWh\", IF(AN10 = \"Town Gas (From Coal)\", \"GJ\",  IF(AN10 = \"LPG\", \"GJ\",  IF(AN10 = \"Natural Gas\", \"GJ\",  IF(AN10 = \"Biogas\", \"GJ\",   IF(AN10 = \"Diesel\", \"L\",  IF(AN10 = \"Oil\", \"L\",   IF(AN10 = \"Coal\", \"Tonnes\", \"\" )) )) ) ) ) )","v":""},{"$f":"IF(AN10 = \"Mains Electricity\", \"1.2\", IF(AN10 = \"Town Gas (From Coal)\", \"0.16\",  IF(AN10 = \"LPG\", \"0.23\",  IF(AN10 = \"Natural Gas\", \"0.2\",  IF(AN10 = \"Biogas\", \"0.03\",   IF(AN10 = \"Diesel\", \"0.27\",  IF(AN10 = \"Oil\", \"0.26\",   IF(AN10 = \"Coal\", \"0.35\", \"\" )) )) ) ) ) )","v":""},null,"-",{"$f":"IF(AO10 = \"Mains Electricity\", \"kWh\", IF(AO10 = \"Town Gas (From Coal)\", \"GJ\",  IF(AO10 = \"LPG\", \"GJ\",  IF(AO10 = \"Natural Gas\", \"GJ\",  IF(AO10 = \"Biogas\", \"GJ\",   IF(AO10 = \"Diesel\", \"L\",  IF(AO10 = \"Oil\", \"L\",   IF(AO10 = \"Coal\", \"Tonnes\", \"\" )) )) ) ) ) )","v":""},{"$f":"IF(AO10 = \"Mains Electricity\", \"1.2\", IF(AO10 = \"Town Gas (From Coal)\", \"0.16\",  IF(AO10 = \"LPG\", \"0.23\",  IF(AO10 = \"Natural Gas\", \"0.2\",  IF(AO10 = \"Biogas\", \"0.03\",   IF(AO10 = \"Diesel\", \"0.27\",  IF(AO10 = \"Oil\", \"0.26\",   IF(AO10 = \"Coal\", \"0.35\", \"\" )) )) ) ) ) )","v":""},null,null,null,"Yes",true,true,{"$f":"IF(AND(T10,U10),D10*(1-(E10/$S$13)),D10)","v":0},{"$f":"IF(AND(T10,U10),D10*(1-(E10/$S$13)),0)","v":0},{"$f":"IF(AND(T10,NOT(U10)),D10,0)","v":0},{"$f":" IF(AN10 = \"Town Gas (From Coal)\", 37.07,  IF(AN10 = \"LPG\", 53.28,  IF(AN10 = \"Natural Gas\", 46.33,  IF(AN10 = \"Biogas\", 6.95,   IF(AN10 = \"Diesel\", 2.67,  IF(AN10 = \"Oil\", 2.53,   IF(AN10 = \"Coal\", 1945.42, 1 )) )) ) ) )","v":1},{"$f":" IF(AO10 = \"Town Gas (From Coal)\", 37.07,  IF(AO10 = \"LPG\", 53.28,  IF(AO10 = \"Natural Gas\", 46.33,  IF(AO10 = \"Biogas\", 6.95,   IF(AO10 = \"Diesel\", 2.67,  IF(AO10 = \"Oil\", 2.53,   IF(AO10 = \"Coal\", 1945.42, 1 )) )) ) ) )","v":1},{"$f":"IF(NOT(T10),Y10*L10,0)","v":0},{"$f":"IF(NOT(T10),Z10*P10,0)","v":0},{"$f":"W10*F10","v":0},{"$f":"X10*45","v":0},{"$f":"AC10+AD10","v":0},{"$f":"IF(AND(T10,U10),G10*(1-(E10/$S$13)),0)","v":0},{"$f":"IF(AND(T10,NOT(U10)),(D10/19),0)","v":0},{"$f":"AF10+AG10","v":0},{"$f":"IF(AND(T10,U10),H10*(1-(E10/$S$13)),0)","v":0},{"$f":"AG10","v":0},{"$f":"AI10+AJ10","v":0},{"$f":"IF(NOT(T10),Q10,0)","v":0},null,"-","-"]
{"$rows_left_out":112}
{"sheet":"Building Zone Guidance","index":5,"n_rows":53,"n_cols":8,"rows_kept":53,"cut":false,"hidden":false,"merged":[[0,0,0,5],[9,0,10,4],[5,0,6,4],[27,0,27,4],[30,0,30,4],[13,0,15,4],[17,0,19,4],[7,0,7,4],[1,0,3,4],[2,7,3,21],[52,0,52,4],[31,0,31,4],[34,0,34,4],[37,0,37,4],[40,0,43,4],[46,0,49,4]]}
["Energy Water Performance Tool                                                                                                                                                              Building Zone Breakdown Guidance File"]
["The Building Zone Breakdown tab allows for a more detailed analysis of the building zones to account for different functionalities, and non-office and excluded zones.",null,null,null,null,null,null,"Example"]
[null,null,null,null,null,null,null,"The following example details how the Building Zone Guidance tab can be used to allocate deafult values to zones used for non-office activities, or subtract energy/water usages from bulk inputs fror excluded zones. "]
[]
["Zone"]
["For the purposes of this rating tool, the rated building is taken to be the sum of all building zones nominated for inclusion in the rating. A building zone denotes an area or a collection of spaces in the building which share the following distinct characteristics:\n• Included or excluded from the rating;\n• Office or non-office usage;\n• Equal annual vacancy rates; \n• Equal weekly operating hours."]
[]
[]
["Included in Rating (Y/N)"]
["In cases where the non-office portion does not exceed 10% of the GLA, the energy and/or water use of the non-office area(s) can be included or excluded from the rating at the owner or assessor’s discretion.  The excluded non-office area(s) must be separately metered and excluded from the figures entered into the rating tool. In cases where the non-office portions exceeds 10% but not 30% of the GLA, the energy and/or water use of the non-office area(s) in excess of the 10% must be separately metered and excluded from the figures entered into the rating tool, such that the maximum non-office portion included in the rating does not exceed 10%. Zones may only be excluded if the energy/water usage of this zone can be isolated from the bulk reading.\n"]
{"$rows_left_out":44}
{"sheet":"Detailed Input Spreadsheet ","index":6,"n_rows":88,"n_cols":20,"rows_kept":88,"cut":false,"hidden":false,"merged":[[80,0,84,9],[21,14,21,16],[21,17,21,18],[21,0,21,6],[11,1,11,2],[12,1,12,2],[13,1,13,2],[0,0,0,9],[21,7,21,9],[8,1,8,2],[9,1,9,2],[10,1,10,2],[7,1,7,2],[19,0,19,2],[7,5,8,6],[15,5,16,6]]}
["Energy Water Performance Tool                                                                                                                                                                                                                          Detailed Input Spreadsheet",null,null,null,null,null,null,null,null,null,null,null,null,null,"-"]
[null,"Transfer to Tool",null,null,null,null,null,null,null,null,null,null,null,null,"Mains Electricity"]
[null,null,null,null,null,null,null,null,null,null,null,null,null,null,"Town Gas (From Coal)"]
[null,"Resets all inputs",null,null,null,null,null,null,null,null,null,null,null,null,"LPG"]
[null,null,null,null,null,null,null,null,null,null,null,null,null,null,"Natural Gas"]
["Building Details",null,null,null,null,"Energy Usage Inputs",null,null,null,null,null,null,null,null,"Biogas"]
[null,null,null,null,null,"Number of Computers",null,0,null,null,null,null,null,null,"Diesel"]
["Building Name",null,null,null,null,"Energy Usage for Previous 12 Months (kWh Equivalent Mains Electricity)",null,{"$f":"IF(Q88>397, \"Too many billing days!\",IF(Q88<334, \"Too few billing days!\", 365*Q82/Q88) )","v":"Too few billing days!"},null,null,null,null,null,null,"Oil"]
["Street Address",null,null,null,null,null,null,null,null,null,null,null,null,null,"Coal"]
[null,null,null,null,null,"Excluded Energy Usage (kWh)",null,0]
{"$rows_left_out":79}
{"sheet":"Detailed Input Guidance","index":7,"n_rows":62,"n_cols":8,"rows_kept":62,"cut":false,"hidden":false,"merged":[[61,0,61,4],[2,7,2,14],[55,0,59,4],[3,0,5,4],[49,0,53,4],[0,0,0,5]]}
["Energy Water Performance Tool                                                                                                                                                             Detailed Input Spreadsheet Guidance File"]
["Building Details",null,null,null,null,null,null,"Example"]
["Postal Code",null,null,null,null,null,null,"The following example shows how the Detailed Input Spreadsheet tab can be used:"]
["The South African postal code system consists of frous digit codes ranging from 0001-9999 (please note that the number range 9000-9299 is excluded as this belongs to regions in Namibia). The following intervals may be used as a rough guide only:"]
[]
[]
["Limpopo"]
["- Northern and eastern regions 0699-0999"]
["- Southern and western regions 0500-0698"]
["North West"]
{"$rows_left_out":53}
{"sheet":"Energy Results","index":8,"n_rows":30,"n_cols":18,"rows_kept":30,"cut":false,"hidden":false,"merged":[[27,0,27,10],[61,2,61,3],[16,9,16,10],[10,7,10,9],[4,7,4,9],[5,7,5,9],[6,7,6,9],[7,7,7,9],[8,7,8,9],[9,7,9,9],[62,2,62,3],[64,0,72,3],[32,0,32,3],[34,0,34,3],[35,0,39,3],[59,2,59,3],[60,2,60,3],[26,6,26,7],[0,0,0,10],[21,9,21,10],[22,9,22,10],[23,9,23,10],[24,9,24,10],[20,6,20,7],[21,6,21,7],[23,6,23,7],[24,6,24,7],[2,1,6,3]]}
["GBCSA's Energy Water Performance v1 Tool                                                                                                                                                                                                    Energy Rating Results",null,null,null,null,null,null,null,null,null,null,null,null,null,null,null,null,"kWh/m²/a"]
[]
[null," ",null,null,null,null," "]
[null,null,null,null,null,null," "]
[null,null,null,null,null,null,"Building Name"]
[null,null,null,null,null,null,"Street Address"]
[]
[null,null,null,null,null,null,"Suburb"]
[null,null,null,null,null,null,"City"]
[null,null,null,null,null,null,"Province"]
{"$rows_left_out":21}
{"sheet":"Water Results","index":9,"n_rows":28,"n_cols":18,"rows_kept":28,"cut":false,"hidden":false,"merged":[[10,7,10,9],[0,0,0,10],[21,9,21,10],[22,9,22,10],[24,9,24,10],[9,7,9,9],[23,6,23,7],[8,7,8,9],[2,1,6,3],[4,7,4,9],[7,7,7,9],[5,7,5,9],[6,7,6,9],[64,0,72,3],[21,6,21,7],[34,0,34,3],[60,2,60,3],[62,2,62,3],[61,2,61,3],[32,0,32,3],[35,0,39,3],[59,2,59,3],[28,0,28,10]]}
["GBCSA's Energy Water Performance v1 Tool                                                                                                                                                                                                    Water Rating Results",null,null,null,null,null,null,null,null,null,null,null,null,null,null,null,null,"kl/m²/a"]
[]
[null," ",null,null,null,null," "]
[null,null,null,null,null,null," "]
[null,null,null,null,null,null,"Building Name"]
[null,null,null,null,null,null,"Street Address"]
[]
[null,null,null,null,null,null,"Suburb"]
[null,null,null,null,null,null,"City"]
[null,null,null,null,null,null,"Province"]
{"$rows_left_out":19}
{"sheet":"DataExtract","index":10,"n_rows":43,"n_cols":4,"rows_kept":43,"cut":false,"hidden":false,"merged":[]}
["Key","Value","Measure"]
["EBP_EWP_Energy_POINTS_SCORE ",{"$f":"'Energy Results'!I27","v":5},null,"ENERGY - Compliance Route 1"]
["EBP_EWP_Water_POINTS_SCORE ",{"$f":"'Water Results'!I24","v":11.5},null,"WATER - Compliance Route 1"]
["EWP_Energy_Rating_(1-10 Scale)",0]
["EWP_Water_Rating_(1-10 Scale)",0]
["EBP_EWP_Total_Energy_Usage",{"$f":"'Energy Results'!I15","v":900000}," (kWh/annum)","ENERGY - Compliance Route 1"]
["EBP_EWP_Total_Mains_Electricity_Equivalent",{"$f":"'Energy Results'!I16","v":900000}," (kWh/annum)"]
["EBP_EWP_Total_Emissions_PerAnnum",{"$f":"'Energy Results'!I17","v":1080000}," (kgCo2/annum)"]
["EBP_EWP_Energy_Intensity",{"$f":"'Energy Results'!I21","v":360}," (kWh/m2/annum)"]
["EBP_EWP_Benchmark_Building_Energy_Intensity",{"$f":"'Energy Results'!I22","v":375.73488943199999}," (kWh/m2/annum)"]
{"$rows_left_out":33}